invertase_react-native-apple-authentication:parseDebugLibraryResources FAILED

Heyo i have a bug when I start a Project from GitHub in Android Studio someone know something about it

Configure project :app
Error ‘Plugin-Version’ of ‘unspecified’ for ‘com.android.build.gradle.AppPlugin@76a4096’ is not a valid version number
OneSignal Warning: Could not get AGP plugin version

Task :invertase_react-native-apple-authentication:parseDebugLibraryResources FAILED

Deprecated Gradle features were used in this build, making it incompatible with Gradle 7.0.
Use ‘–warning-mode all’ to show the individual deprecation warnings.
See Command-Line Interface
8 actionable tasks: 2 executed, 6 up-to-date

FAILURE: Build failed with an exception.

  • What went wrong:
    Execution failed for task ‘:invertase_react-native-apple-authentication:parseDebugLibraryResources’.

Could not resolve all files for configuration ‘:invertase_react-native-apple-authentication:androidApis’.
Failed to transform android.jar to match attributes {artifactType=android-platform-attr, org.gradle.libraryelements=jar, org.gradle.usage=java-runtime}.
Execution failed for PlatformAttrTransform: /Users/admin/Library/Android/sdk/platforms/android-29/android.jar.
/Users/admin/Library/Android/sdk/platforms/android-29/android.jar (No such file or directory)

  • Try:
    Run with --stacktrace option to get the stack trace. Run with --info or --debug option to get more log output. Run with --scan to get full insights.

  • Get more help at

BUILD FAILED in 9s

error Failed to install the app. Make sure you have the Android development environment set up: Setting up the development environment · React Native. Run CLI with --verbose flag for more details.
Error: Command failed: ./gradlew app:installDebug -PreactNativeDevServerPort=8081

error Command failed with exit code 1.