i need help with circil.ci respositories they all fail i want to deploy test learn

Commits (1)
TYETECHNOLOGIESGitHub30c53f5Create
Test Summary
Queue (00:00)
Debug via SSH
Artifacts
Configuration
Build Timing
Set Up Test Summary

Show containers:All (1)Successful (0)Failed (1)
0

(00:27)
+

infrastructure

Starting the build
00:03

Start container
00:02
config

Enable SSH
00:00

checkout

Restore source cache
00:00
cache

Checkout using deploy key: c5:35:63:f6:d9:45:94:2e:45:ac:2c:8a:f5:71:74:6c
00:01
config

machine

Configure the build
00:01
cache

Select Xcode Version
00:00
inference

Install Code Signing Credentials
00:02
inference

Restore cache
00:00
cache

database

Save cache
00:01
cache

test

Xcode build and run tests
00:05
inference
Exit code: 65
export LC_CTYPE=“en_US.UTF-8”
set -o pipefail && xcodebuild -project ‘Jetstream.xcodeproj’ -scheme ‘Jetstream’ clean build test -sdk iphonesimulator -destination ‘platform=iOS Simulator,name=iPhone 6,OS=latest’ CODE_SIGNING_REQUIRED=NO CODE_SIGN_IDENTITY= PROVISIONING_PROFILE= | tee $CIRCLE_ARTIFACTS/xcode_raw.log | xcpretty --color --report junit --output $CIRCLE_TEST_REPORTS/xcode/results.xml
▸ Cleaning Jetstream/Jetstream [Debug]
▸ Check Dependencies
▸ Cleaning Jetstream/JetstreamTests [Debug]
▸ Check Dependencies
▸ Clean Succeeded
▸ Building Jetstream/Jetstream [Debug]
▸ Check Dependencies
▸ Processing Info.plist

:x: error: no such file or directory: /Users/distiller/jetstream-ios/Jetstream/Starscream/WebSocket.swift

:x: error: no such file or directory: /Users/distiller/jetstream-ios/Jetstream/Starscream/SSLSecurity.swift

:x: error: no such file or directory: /Users/distiller/jetstream-ios/Jetstream/Signals/Signals/Signal.swift

** BUILD FAILED **

The following build commands failed:
CompileSwiftSources normal x86_64 com.apple.xcode.tools.swift.compiler
(1 failure)
2018-01-11 12:07:03.049 xcodebuild[802:5951] [MT] IDETestOperationsObserverDebug: (655FB86C-C461-47DB-BD69-AADD57CB966A) Beginning test session with Xcode 7A220 on target <DVTiPhoneSimulator: 0x7f8a15718590> {
SimDevice: SimDevice : iPhone 6 (AFF57D3F-41F8-4A9A-B0DA-9FC6DBB3ACCA) : state={ Shutdown } deviceType={ SimDeviceType : com.apple.CoreSimulator.SimDeviceType.iPhone-6 } runtime={ SimRuntime : 10.1 (14B72) - com.apple.CoreSimulator.SimRuntime.iOS-10-1 }
} (10.1 (14B72))
▸ Building Jetstream/Jetstream [Debug]
▸ Check Dependencies

:x: error: no such file or directory: /Users/distiller/jetstream-ios/Jetstream/Starscream/WebSocket.swift

:x: error: no such file or directory: /Users/distiller/jetstream-ios/Jetstream/Starscream/SSLSecurity.swift

:x: error: no such file or directory: /Users/distiller/jetstream-ios/Jetstream/Signals/Signals/Signal.swift

Testing failed:
Command /Applications/Xcode-7.0.app/Contents/Developer/Toolchains/XcodeDefault.xctoolchain/usr/bin/swiftc failed with exit code 1
** TEST FAILED **

The following build commands failed:
CompileSwiftSources normal x86_64 com.apple.xcode.tools.swift.compiler
(1 failure)

export LC_CTYPE=“en_US.UTF-8”
set -o pipefail && xcodebuild -project ‘Jetstream.xcodeproj’ -scheme ‘Jetstream’ clean build test -sdk iphonesimulator -destination ‘platform=iOS Simulator,name=iPhone 6,OS=latest’ CODE_SIGNING_REQUIRED=NO CODE_SIGN_IDENTITY= PROVISIONING_PROFILE= | tee $CIRCLE_ARTIFACTS/xcode_raw.log | xcpretty --color --report junit --output $CIRCLE_TEST_REPORTS/xcode/results.xml
returned exit code 65
teardown

Collect Xcode activity logs
00:00
inference

Collect test metadata
00:01

Collect artifacts
00:04

Ensure caches are uploaded
00:00
cache

Disable SSH