How to update windows SDK version?

On my local Win-10 machine, my build succeed but not on github actions (when compiling using MSVC, reduce the warning levels. · dilawar/Smoldyn@0a69a4b · GitHub). The only difference b/w github action and my local machine is Windows SDK version: on my local machine it is 10.0.18336.0 while on github it is 10.0.17763.

I am getting the following error at Github Action

2021-05-21T05:54:42.5572172Z C:\Program Files (x86)\Windows Kits\10\Include\10.0.17763.0\shared\wtypes.h(745): message : in expansion of macro '_VARIANT_BOOL' [D:\a\Smoldyn\Smoldyn\build\source\libSteve\Steve.vcxproj]
2021-05-21T05:54:42.5771590Z C:\Program Files (x86)\Windows Kits\10\Include\10.0.17763.0\um\oaidl.h(487,17): error C2059: syntax error: '/' [D:\a\Smoldyn\Smoldyn\build\source\libSteve\Steve.vcxproj]
2021-05-21T05:54:42.5775983Z C:\Program Files (x86)\Windows Kits\10\Include\10.0.17763.0\um\oaidl.h(502,17): warning C5103: pasting '/' and '/' does not result in a valid preprocessing token [D:\a\Smoldyn\Smoldyn\build\source\libSteve\Steve.vcxproj]
2021-05-21T05:54:42.5781668Z C:\Program Files (x86)\Windows Kits\10\Include\10.0.17763.0\shared\wtypes.h(745): message : in expansion of macro '_VARIANT_BOOL' [D:\a\Smoldyn\Smoldyn\build\source\libSteve\Steve.vcxproj]
2021-05-21T05:54:42.5784135Z C:\Program Files (x86)\Windows Kits\10\Include\10.0.17763.0\um\oaidl.h(502,17): error C2059: syntax error: '/' [D:\a\Smoldyn\Smoldyn\build\source\libSteve\Steve.vcxproj]
2021-05-21T05:54:42.5786253Z C:\Program Files (x86)\Windows Kits\10\Include\10.0.17763.0\um\oaidl.h(530,17): error C2059: syntax error: '}' [D:\a\Smoldyn\Smoldyn\build\source\libSteve\Steve.vcxproj]
2021-05-21T05:54:42.5787985Z C:\Program Files (x86)\Windows Kits\10\Include\10.0.17763.0\um\oaidl.h(531,13): error C2059: syntax error: '}' [D:\a\Smoldyn\Smoldyn\build\source\libSteve\Steve.vcxproj]
2021-05-21T05:54:42.5789635Z C:\Program Files (x86)\Windows Kits\10\Include\10.0.17763.0\um\oaidl.h(533,9): error C2059: syntax error: '}' [D:\a\Smoldyn\Smoldyn\build\source\libSteve\Steve.vcxproj]
2021-05-21T05:54:42.5791292Z C:\Program Files (x86)\Windows Kits\10\Include\10.0.17763.0\um\oaidl.h(534,5): error C2059: syntax error: '}' [D:\a\Smoldyn\Smoldyn\build\source\libSteve\Steve.vcxproj]
2021-05-21T05:54:42.5793201Z C:\Program Files (x86)\Windows Kits\10\Include\10.0.17763.0\um\oaidl.h(665,16): error C2079: 'varDefaultValue' uses undefined struct 'tagVARIANT' [D:\a\Smoldyn\Smoldyn\build\source\libSteve\Steve.vcxproj]
2021-05-21T05:54:42.5795324Z C:\Program Files (x86)\Windows Kits\10\Include\10.0.17763.0\um\oaidl.h(950,16): error C2079: 'varValue' uses undefined struct 'tagVARIANT' [D:\a\Smoldyn\Smoldyn\build\source\libSteve\Steve.vcxproj]
2021-05-21T05:54:42.6072200Z C:\Program Files (x86)\Windows Kits\10\Include\10.0.17763.0\um\propidlbase.h(319,24): warning C5103: pasting '/' and '/' does not result in a valid preprocessing token [D:\a\Smoldyn\Smoldyn\build\source\libSteve\Steve.vcxproj]

[jasper] build failure · Issue #15035 · microsoft/vcpkg · GitHub suggests to update the sdk version which goes well with my experience.

How to update windows SDK on github actions on windows-latest?