Cannot resolve maven package published on github package manager

I have a private repo that i had setup a few month ago. I had setup github actions to push to https://maven.pkg.github.com/*** and i was able to resolve with maven using my userid and generated token. And all of a sudden(about a week ago), I can no longer download the artifacts using maven. What is strange is when i click packages in the UI under the organization all may packages are gone . However the github actions still publishes successfully. I am wondering if i had hit some kind of weird limit. But even then I have not received notification on such a thing. I am on a Pro subscription and this is an organization under my acccount.

packages UI

Succesful publish log

[INFO] Installing /home/runner/work/auto-task/auto-task/pom.xml to /home/runner/.m2/repository/com/integ/auto-task/0.20.0-SNAPSHOT/auto-task-0.20.0-SNAPSHOT.pom
[INFO] Installing /home/runner/work/auto-task/auto-task/target/auto-task-0.20.0-SNAPSHOT-sources.jar to /home/runner/.m2/repository/com/integ/auto-task/0.20.0-SNAPSHOT/auto-task-0.20.0-SNAPSHOT-sources.jar
[INFO] 
[INFO] --- maven-deploy-plugin:2.7:deploy (default-deploy) @ auto-task ---
[INFO] Downloading from github-data-suite: https://maven.pkg.github.com/integ-data-suite/auto-task/com/integ/auto-task/0.20.0-SNAPSHOT/maven-metadata.xml
[INFO] Uploading to github-data-suite: https://maven.pkg.github.com/integ-data-suite/auto-task/com/integ/auto-task/0.20.0-SNAPSHOT/auto-task-0.20.0-20211123.145132-1.jar
[INFO] Uploaded to github-data-suite: https://maven.pkg.github.com/integ-data-suite/auto-task/com/integ/auto-task/0.20.0-SNAPSHOT/auto-task-0.20.0-20211123.145132-1.jar (544 kB at 110 kB/s)
[INFO] Uploading to github-data-suite: https://maven.pkg.github.com/integ-data-suite/auto-task/com/integ/auto-task/0.20.0-SNAPSHOT/auto-task-0.20.0-20211123.145132-1.pom
[INFO] Uploaded to github-data-suite: https://maven.pkg.github.com/integ-data-suite/auto-task/com/integ/auto-task/0.20.0-SNAPSHOT/auto-task-0.20.0-20211123.145132-1.pom (10 kB at 2.6 kB/s)
[INFO] Downloading from github-data-suite: https://maven.pkg.github.com/integ-data-suite/auto-task/com/integ/auto-task/maven-metadata.xml
[INFO] Downloaded from github-data-suite: https://maven.pkg.github.com/integ-data-suite/auto-task/com/integ/auto-task/maven-metadata.xml (236 B at 504 B/s)
[INFO] Uploading to github-data-suite: https://maven.pkg.github.com/integ-data-suite/auto-task/com/integ/auto-task/0.20.0-SNAPSHOT/maven-metadata.xml
[INFO] Uploaded to github-data-suite: https://maven.pkg.github.com/integ-data-suite/auto-task/com/integ/auto-task/0.20.0-SNAPSHOT/maven-metadata.xml (771 B at 3.1 kB/s)
[INFO] Uploading to github-data-suite: https://maven.pkg.github.com/integ-data-suite/auto-task/com/integ/auto-task/maven-metadata.xml
[INFO] Uploaded to github-data-suite: https://maven.pkg.github.com/integ-data-suite/auto-task/com/integ/auto-task/maven-metadata.xml (316 B at 1.2 kB/s)
[INFO] Uploading to github-data-suite: https://maven.pkg.github.com/integ-data-suite/auto-task/com/integ/auto-task/0.20.0-SNAPSHOT/auto-task-0.20.0-20211123.145132-1-sources.jar
[INFO] Uploaded to github-data-suite: https://maven.pkg.github.com/integ-data-suite/auto-task/com/integ/auto-task/0.20.0-SNAPSHOT/auto-task-0.20.0-20211123.145132-1-sources.jar (280 kB at 63 kB/s)
[INFO] Uploading to github-data-suite: https://maven.pkg.github.com/integ-data-suite/auto-task/com/integ/auto-task/0.20.0-SNAPSHOT/maven-metadata.xml
[INFO] Uploaded to github-data-suite: https://maven.pkg.github.com/integ-data-suite/auto-task/com/integ/auto-task/0.20.0-SNAPSHOT/maven-metadata.xml (986 B at 4.1 kB/s)
[INFO] ------------------------------------------------------------------------
[INFO] BUILD SUCCESS
[INFO] ------------------------------------------------------------------------
[INFO] Total time:  44.776 s
[INFO] Finished at: 2021-11-23T14:52:17Z
[INFO] ------------------------------------------------------------------------

mavne debug log

[DEBUG] =======================================================================
[DEBUG] Could not find metadata com.integ:auto-task:0.20.0-SNAPSHOT/maven-metadata.xml in local (/Users/showdown/.m2/repository)
[DEBUG] Using transporter WagonTransporter with priority -1.0 for https://maven.pkg.github.com/integ-data-suite/*
[DEBUG] Using connector BasicRepositoryConnector with priority 0.0 for https://maven.pkg.github.com/integ-data-suite/* with username=fobbyal, password=***
Downloading from github-data-suite: https://maven.pkg.github.com/integ-data-suite/*/com/integ/auto-task/0.20.0-SNAPSHOT/maven-metadata.xml
[DEBUG] Writing tracking file /Users/showdown/.m2/repository/com/integ/auto-task/0.20.0-SNAPSHOT/resolver-status.properties
[DEBUG] Could not find metadata com.integ:auto-task:0.20.0-SNAPSHOT/maven-metadata.xml in github-data-suite (https://maven.pkg.github.com/integ-data-suite/*)
[DEBUG] Could not find metadata com.integ:auto-task:0.20.0-SNAPSHOT/maven-metadata.xml in local (/Users/showdown/.m2/repository)
[DEBUG] Skipped remote request for com.integ:auto-task:0.20.0-SNAPSHOT/maven-metadata.xml, already updated during this session.
[DEBUG] Failure to find com.integ:auto-task:0.20.0-SNAPSHOT/maven-metadata.xml in https://maven.pkg.github.com/integ-data-suite/* was cached in the local repository, resolution will not be reattempted until the update interval of github-data-suite has elapsed or updates are forced
[DEBUG] Using transporter WagonTransporter with priority -1.0 for https://maven.pkg.github.com/integ-data-suite/*
[DEBUG] Using connector BasicRepositoryConnector with priority 0.0 for https://maven.pkg.github.com/integ-data-suite/* with username=fobbyal, password=***
Downloading from github-data-suite: https://maven.pkg.github.com/integ-data-suite/*/com/integ/auto-task/0.20.0-SNAPSHOT/auto-task-0.20.0-SNAPSHOT.pom
[DEBUG] Writing tracking file /Users/showdown/.m2/repository/com/integ/auto-task/0.20.0-SNAPSHOT/auto-task-0.20.0-SNAPSHOT.pom.lastUpdated
[WARNING] The POM for com.integ:auto-task:jar:0.20.0-SNAPSHOT is missing, no dependency information available
[DEBUG] Dependency collection stats: {ConflictMarker.analyzeTime=559900, ConflictMarker.markTime=346263, ConflictMarker.nodeCount=2, ConflictIdSorter.graphTime=318278, ConflictIdSorter.topsortTime=275914, ConflictIdSorter.conflictIdCount=1, ConflictIdSorter.conflictIdCycleCount=0, Co
nflictResolver.totalTime=2487457, ConflictResolver.conflictItemCount=1, DefaultDependencyCollector.collectTime=887571387, DefaultDependencyCollector.transformTime=6103316}
[DEBUG] com.integ:test:jar:0.0.1-SNAPSHOT
[DEBUG]    com.integ:auto-task:jar:0.20.0-SNAPSHOT:compile
[DEBUG] Using transporter WagonTransporter with priority -1.0 for https://maven.pkg.github.com/integ-data-suite/*
[DEBUG] Using connector BasicRepositoryConnector with priority 0.0 for https://maven.pkg.github.com/integ-data-suite/* with username=fobbyal, password=***
Downloading from github-data-suite: https://maven.pkg.github.com/integ-data-suite/*/com/integ/auto-task/0.20.0-SNAPSHOT/auto-task-0.20.0-SNAPSHOT.jar
[DEBUG] Writing tracking file /Users/showdown/.m2/repository/com/integ/auto-task/0.20.0-SNAPSHOT/auto-task-0.20.0-SNAPSHOT.jar.lastUpdated
[INFO] ------------------------------------------------------------------------
[INFO] BUILD FAILURE
[INFO] ------------------------------------------------------------------------
[INFO] Total time: 1.781 s
[INFO] Finished at: 2021-11-23T11:11:17-05:00
[INFO] ------------------------------------------------------------------------
[ERROR] Failed to execute goal on project test: Could not resolve dependencies for project com.integ:test:jar:0.0.1-SNAPSHOT: Could not find artifact com.integ:auto-task:jar:0.20.0-SNAPSHOT in github-data-suite (https://maven.pkg.github.com/integ-data-suite/*) -> [Help 1]
org.apache.maven.lifecycle.LifecycleExecutionException: Failed to execute goal on project test: Could not resolve dependencies for project com.integ:test:jar:0.0.1-SNAPSHOT: Could not find artifact com.integ:auto-task:jar:0.20.0-SNAPSHOT in github-data-suite (https://maven.pkg.github
.com/integ-data-suite/*)
    at org.apache.maven.lifecycle.internal.LifecycleDependencyResolver.getDependencies (LifecycleDependencyResolver.java:269)
    at org.apache.maven.lifecycle.internal.LifecycleDependencyResolver.resolveProjectDependencies (LifecycleDependencyResolver.java:147)
    at org.apache.maven.lifecycle.internal.MojoExecutor.ensureDependenciesAreResolved (MojoExecutor.java:246)
    at org.apache.maven.lifecycle.internal.MojoExecutor.execute (MojoExecutor.java:200)
    at org.apache.maven.lifecycle.internal.MojoExecutor.execute (MojoExecutor.java:154)
    at org.apache.maven.lifecycle.internal.MojoExecutor.execute (MojoExecutor.java:146)
    at org.apache.maven.lifecycle.internal.LifecycleModuleBuilder.buildProject (LifecycleModuleBuilder.java:117)
    at org.apache.maven.lifecycle.internal.LifecycleModuleBuilder.buildProject (LifecycleModuleBuilder.java:81)
    at org.apache.maven.lifecycle.internal.builder.singlethreaded.SingleThreadedBuilder.build (SingleThreadedBuilder.java:56)
    at org.apache.maven.lifecycle.internal.LifecycleStarter.execute (LifecycleStarter.java:128)
    at org.apache.maven.DefaultMaven.doExecute (DefaultMaven.java:305)
    at org.apache.maven.DefaultMaven.doExecute (DefaultMaven.java:192)
    at org.apache.maven.DefaultMaven.execute (DefaultMaven.java:105)
    at org.apache.maven.cli.MavenCli.execute (MavenCli.java:954)
    at org.apache.maven.cli.MavenCli.doMain (MavenCli.java:288)
    at org.apache.maven.cli.MavenCli.main (MavenCli.java:192)
    at sun.reflect.NativeMethodAccessorImpl.invoke0 (Native Method)
    at sun.reflect.NativeMethodAccessorImpl.invoke (NativeMethodAccessorImpl.java:62)
    at sun.reflect.DelegatingMethodAccessorImpl.invoke (DelegatingMethodAccessorImpl.java:43)
    at java.lang.reflect.Method.invoke (Method.java:498)
    at org.codehaus.plexus.classworlds.launcher.Launcher.launchEnhanced (Launcher.java:289)
    at org.codehaus.plexus.classworlds.launcher.Launcher.launch (Launcher.java:229)
    at org.codehaus.plexus.classworlds.launcher.Launcher.mainWithExitCode (Launcher.java:415)
    at org.codehaus.plexus.classworlds.launcher.Launcher.main (Launcher.java:356)
Caused by: org.apache.maven.project.DependencyResolutionException: Could not resolve dependencies for project com.integ:test:jar:0.0.1-SNAPSHOT: Could not find artifact com.integ:auto-task:jar:0.20.0-SNAPSHOT in github-data-suite (https://maven.pkg.github.com/integ-data-suite/*)
    at org.apache.maven.project.DefaultProjectDependenciesResolver.resolve (DefaultProjectDependenciesResolver.java:209)
   at org.apache.maven.lifecycle.internal.LifecycleDependencyResolver.getDependencies (LifecycleDependencyResolver.java:243)                                                                                                                                                      [56/1740]
    at org.apache.maven.lifecycle.internal.LifecycleDependencyResolver.resolveProjectDependencies (LifecycleDependencyResolver.java:147)
    at org.apache.maven.lifecycle.internal.MojoExecutor.ensureDependenciesAreResolved (MojoExecutor.java:246)
    at org.apache.maven.lifecycle.internal.MojoExecutor.execute (MojoExecutor.java:200)
    at org.apache.maven.lifecycle.internal.MojoExecutor.execute (MojoExecutor.java:154)
    at org.apache.maven.lifecycle.internal.MojoExecutor.execute (MojoExecutor.java:146)
    at org.apache.maven.lifecycle.internal.LifecycleModuleBuilder.buildProject (LifecycleModuleBuilder.java:117)
    at org.apache.maven.lifecycle.internal.LifecycleModuleBuilder.buildProject (LifecycleModuleBuilder.java:81)
    at org.apache.maven.lifecycle.internal.builder.singlethreaded.SingleThreadedBuilder.build (SingleThreadedBuilder.java:56)
    at org.apache.maven.lifecycle.internal.LifecycleStarter.execute (LifecycleStarter.java:128)
    at org.apache.maven.DefaultMaven.doExecute (DefaultMaven.java:305)
    at org.apache.maven.DefaultMaven.doExecute (DefaultMaven.java:192)
    at org.apache.maven.DefaultMaven.execute (DefaultMaven.java:105)
    at org.apache.maven.cli.MavenCli.execute (MavenCli.java:954)
    at org.apache.maven.cli.MavenCli.doMain (MavenCli.java:288)
    at org.apache.maven.cli.MavenCli.main (MavenCli.java:192)
    at sun.reflect.NativeMethodAccessorImpl.invoke0 (Native Method)
    at sun.reflect.NativeMethodAccessorImpl.invoke (NativeMethodAccessorImpl.java:62)
    at sun.reflect.DelegatingMethodAccessorImpl.invoke (DelegatingMethodAccessorImpl.java:43)
    at java.lang.reflect.Method.invoke (Method.java:498)
    at org.codehaus.plexus.classworlds.launcher.Launcher.launchEnhanced (Launcher.java:289)
    at org.codehaus.plexus.classworlds.launcher.Launcher.launch (Launcher.java:229)
    at org.codehaus.plexus.classworlds.launcher.Launcher.mainWithExitCode (Launcher.java:415)
    at org.codehaus.plexus.classworlds.launcher.Launcher.main (Launcher.java:356)
Caused by: org.eclipse.aether.resolution.DependencyResolutionException: Could not find artifact com.integ:auto-task:jar:0.20.0-SNAPSHOT in github-data-suite (https://maven.pkg.github.com/integ-data-suite/*)
    at org.eclipse.aether.internal.impl.DefaultRepositorySystem.resolveDependencies (DefaultRepositorySystem.java:355)
    at org.apache.maven.project.DefaultProjectDependenciesResolver.resolve (DefaultProjectDependenciesResolver.java:202)
    at org.apache.maven.lifecycle.internal.LifecycleDependencyResolver.getDependencies (LifecycleDependencyResolver.java:243)
    at org.apache.maven.lifecycle.internal.LifecycleDependencyResolver.resolveProjectDependencies (LifecycleDependencyResolver.java:147)
    at org.apache.maven.lifecycle.internal.MojoExecutor.ensureDependenciesAreResolved (MojoExecutor.java:246)
    at org.apache.maven.lifecycle.internal.MojoExecutor.execute (MojoExecutor.java:200)
    at org.apache.maven.lifecycle.internal.MojoExecutor.execute (MojoExecutor.java:154)
    at org.apache.maven.lifecycle.internal.MojoExecutor.execute (MojoExecutor.java:146)
    at org.apache.maven.lifecycle.internal.LifecycleModuleBuilder.buildProject (LifecycleModuleBuilder.java:117)
    at org.apache.maven.lifecycle.internal.LifecycleModuleBuilder.buildProject (LifecycleModuleBuilder.java:81)
    at org.apache.maven.lifecycle.internal.builder.singlethreaded.SingleThreadedBuilder.build (SingleThreadedBuilder.java:56)
    at org.apache.maven.lifecycle.internal.LifecycleStarter.execute (LifecycleStarter.java:128)
    at org.apache.maven.DefaultMaven.doExecute (DefaultMaven.java:305)
    at org.apache.maven.DefaultMaven.doExecute (DefaultMaven.java:192)
    at org.apache.maven.DefaultMaven.execute (DefaultMaven.java:105)
    at org.apache.maven.cli.MavenCli.execute (MavenCli.java:954)
    at org.apache.maven.cli.MavenCli.doMain (MavenCli.java:288)
    at org.apache.maven.cli.MavenCli.main (MavenCli.java:192)
    at sun.reflect.NativeMethodAccessorImpl.invoke0 (Native Method)
    at sun.reflect.NativeMethodAccessorImpl.invoke (NativeMethodAccessorImpl.java:62)
    at sun.reflect.DelegatingMethodAccessorImpl.invoke (DelegatingMethodAccessorImpl.java:43)
    at java.lang.reflect.Method.invoke (Method.java:498)
    at org.codehaus.plexus.classworlds.launcher.Launcher.launchEnhanced (Launcher.java:289)
    at org.codehaus.plexus.classworlds.launcher.Launcher.launch (Launcher.java:229)
    at org.codehaus.plexus.classworlds.launcher.Launcher.mainWithExitCode (Launcher.java:415)
    at org.codehaus.plexus.classworlds.launcher.Launcher.main (Launcher.java:356)
Caused by: org.eclipse.aether.resolution.ArtifactResolutionException: Could not find artifact com.integ:auto-task:jar:0.20.0-SNAPSHOT in github-data-suite (https://maven.pkg.github.com/integ-data-suite/*)
    at org.eclipse.aether.internal.impl.DefaultArtifactResolver.resolve (DefaultArtifactResolver.java:422)
    at org.eclipse.aether.internal.impl.DefaultArtifactResolver.resolveArtifacts (DefaultArtifactResolver.java:224)
    at org.eclipse.aether.internal.impl.DefaultRepositorySystem.resolveDependencies (DefaultRepositorySystem.java:338)
    at org.apache.maven.project.DefaultProjectDependenciesResolver.resolve (DefaultProjectDependenciesResolver.java:202)
    at org.apache.maven.lifecycle.internal.LifecycleDependencyResolver.getDependencies (LifecycleDependencyResolver.java:243)
    at org.apache.maven.lifecycle.internal.LifecycleDependencyResolver.resolveProjectDependencies (LifecycleDependencyResolver.java:147)
    at org.apache.maven.lifecycle.internal.MojoExecutor.ensureDependenciesAreResolved (MojoExecutor.java:246)
    at org.apache.maven.lifecycle.internal.MojoExecutor.execute (MojoExecutor.java:200)
    at org.apache.maven.lifecycle.internal.MojoExecutor.execute (MojoExecutor.java:154)
    at org.apache.maven.lifecycle.internal.MojoExecutor.execute (MojoExecutor.java:146)
    at org.apache.maven.lifecycle.internal.LifecycleModuleBuilder.buildProject (LifecycleModuleBuilder.java:117)
    at org.apache.maven.lifecycle.internal.LifecycleModuleBuilder.buildProject (LifecycleModuleBuilder.java:81)
    at org.apache.maven.lifecycle.internal.builder.singlethreaded.SingleThreadedBuilder.build (SingleThreadedBuilder.java:56)
    at org.apache.maven.lifecycle.internal.LifecycleStarter.execute (LifecycleStarter.java:128)